Reaction Details
TargetP2X purinoceptor 4
LigandBDBM50370141
Substrate/Competitorn/a
Meas. Tech.ChEMBL_876885 (CHEMBL2184479)
IC50 15200±n/a nM
Citation Hernandez-Olmos, VAbdelrahman, AEl-Tayeb, AFreudendahl, DWeinhausen, SMüller, CE N-substituted phenoxazine and acridone derivatives: structure-activity relationships of potent P2X4 receptor antagonists. J Med Chem55:9576-88 (2012) 
 
P2X purinoceptor 4
Name:P2X purinoceptor 4
Type:Enzyme Catalytic Domain
Mol. Mass.:43374.70
Organism:Homo sapiens (Human)
Description:Purinergic, P2X4 0 HUMAN::Q99571
Residue:388
BDBM50370141
NameBDBM50370141
Synonyms:TNP-ATP
TypeSmall organic molecule
Emp. Form.C16H16N8O19P3
Mol. Mass.717.2623
SMILESNc1ncnc2n(cnc12)C1OC(COP(O)(=O)OP(O)(=O)OP(O)(O)=O)C2OC3(OC12)C(=C[C-](C=C3[N+]([O-])=O)[N+]([O-])=O)[N+]([O-])=O