Reaction Details
TargetP2X purinoceptor 4
LigandBDBM50118232
Substrate/Competitorn/a
Meas. Tech.ChEMBL_876885 (CHEMBL2184479)
EC50 10000±n/a nM
Citation Hernandez-Olmos, VAbdelrahman, AEl-Tayeb, AFreudendahl, DWeinhausen, SMüller, CE N-substituted phenoxazine and acridone derivatives: structure-activity relationships of potent P2X4 receptor antagonists. J Med Chem55:9576-88 (2012) 
 
P2X purinoceptor 4
Name:P2X purinoceptor 4
Type:Enzyme Catalytic Domain
Mol. Mass.:43374.70
Organism:Homo sapiens (Human)
Description:Purinergic, P2X4 0 HUMAN::Q99571
Residue:388
BDBM50118232
NameBDBM50118232
Synonyms:2-MeSATP CHEMBL336208
TypeSmall organic molecule
Emp. Form.C11H18N5O13P3S
Mol. Mass.553.273
SMILESCSc1nc(N)c2ncn([C@@H]3O[C@H](COP(O)(=O)OP(O)(=O)OP(O)(O)=O)[C@@H](O)[C@H]3O)c2n1