Reaction Details
TargetP2X purinoceptor 3
LigandBDBM50399190
Substrate/Competitorn/a
Meas. Tech.ChEMBL_876872 (CHEMBL2184466)
IC50 429±n/a nM
Citation Hernandez-Olmos, VAbdelrahman, AEl-Tayeb, AFreudendahl, DWeinhausen, SMüller, CE N-substituted phenoxazine and acridone derivatives: structure-activity relationships of potent P2X4 receptor antagonists. J Med Chem55:9576-88 (2012) 
 
P2X purinoceptor 3
Name:P2X purinoceptor 3
Type:Protein
Mol. Mass.:44292.02
Organism:Homo sapiens (Human)
Description:P56373
Residue:397
BDBM50399190
NameBDBM50399190
Synonyms:CHEMBL2180149
TypeSmall organic molecule
Emp. Form.C26H21NO
Mol. Mass.363.451
SMILESOC1(c2ccccc2)c2ccccc2N(Cc2ccccc2)c2ccccc12