Reaction Details
TargetThymidylate synthase
LigandBDBM50399277
Substrate/Competitorn/a
Meas. Tech.ChEMBL_877077 (CHEMBL2186813)
Ki 2500±n/a nM
Citation Carosati, ETochowicz, AMarverti, GGuaitoli, GBenedetti, PFerrari, SStroud, RMFiner-Moore, JLuciani, RFarina, DCruciani, GCosti, MP Inhibitor of ovarian cancer cells growth by virtual screening: a new thiazole derivative targeting human thymidylate synthase. J Med Chem55:10272-6 (2012) 
 
Thymidylate synthase
Name:Thymidylate synthase
Type:Enzyme
Mol. Mass.:35718.07
Organism:Homo sapiens (Human)
Description:n/a
Residue:313
BDBM50399277
NameBDBM50399277
Synonyms:CHEMBL2180553
TypeSmall organic molecule
Emp. Form.C19H15F3N4O3S
Mol. Mass.436.408
SMILESOc1nc(N=NCc2ccccc2O)sc1CC(=O)Nc1cccc(c1)C(F)(F)F