Reaction Details
TargetReceptor-type tyrosine-protein kinase FLT3
LigandBDBM47167
Substrate/Competitorn/a
Meas. Tech.ChEMBL_877496 (CHEMBL2183650)
IC50 18±n/a nM
Citation Ganser, CLauermann, EMaderer, AStauder, TKramb, JPPlutizki, SKindler, TMoehler, MDannhardt, G Novel 3-Azaindolyl-4-arylmaleimides exhibiting potent antiangiogenic efficacy, protein kinase inhibition, and antiproliferative activity. J Med Chem55:9531-40 (2012) 
 
Receptor-type tyrosine-protein kinase FLT3
Name:Receptor-type tyrosine-protein kinase FLT3
Type:Enzyme
Mol. Mass.:112888.62
Organism:Homo sapiens (Human)
Description:P36888
Residue:993
BDBM47167
NameBDBM47167
Synonyms:CHEMBL201511 US9364459, A
Typen/a
Emp. Form.C21H18N2O5
Mol. Mass.378.378
SMILESCOc1cc(cc(OC)c1OC)C1=C(C(=O)NC1=O)c1c[nH]c2ccccc12