Reaction Details
TargetVascular endothelial growth factor receptor 2
LigandBDBM50399334
Substrate/Competitorn/a
Meas. Tech.ChEMBL_877495 (CHEMBL2183649)
IC50 37±n/a nM
Citation Ganser, CLauermann, EMaderer, AStauder, TKramb, JPPlutizki, SKindler, TMoehler, MDannhardt, G Novel 3-Azaindolyl-4-arylmaleimides exhibiting potent antiangiogenic efficacy, protein kinase inhibition, and antiproliferative activity. J Med Chem55:9531-40 (2012) 
 
Vascular endothelial growth factor receptor 2
Name:Vascular endothelial growth factor receptor 2
Type:Receptor Tyrosine Kinase
Mol. Mass.:151510.97
Organism:Homo sapiens (Human)
Description:P35968
Residue:1356
BDBM50399334
NameBDBM50399334
Synonyms:CHEMBL2180878 | US9364459, B
TypeSmall organic molecule
Emp. Form.C20H17N3O5
Mol. Mass.379.3661
SMILESCOc1cc(cc(OC)c1OC)C1=C(C(=O)NC1=O)c1c[nH]c2ncccc12