Reaction Details
TargetC-type lectin domain family 4 member K
LigandBDBM50399360
Substrate/Competitorn/a
Meas. Tech.ChEMBL_877649 (CHEMBL2185428)
IC50 1000000±n/a nM
Citation Scharenberg, MSchwardt, ORabbani, SErnst, B Target Selectivity of FimH Antagonists. J Med Chem55:9810-6 (2012) 
 
C-type lectin domain family 4 member K
Name:C-type lectin domain family 4 member K
Type:PROTEIN
Mol. Mass.:36729.14
Organism:Homo sapiens (Human)
Description:ChEMBL_877649
Residue:328
BDBM50399360
NameBDBM50399360
Synonyms:CHEMBL1852052
TypeSmall organic molecule
Emp. Form.C19H19ClO8
Mol. Mass.410.802
SMILESOC[C@H]1O[C@H](Oc2ccc(cc2Cl)-c2ccc(cc2)C(O)=O)[C@@H](O)[C@@H](O)[C@@H]1O