Reaction Details
TargetNeuronal acetylcholine receptor subunit alpha-4/beta-2
LigandBDBM50399423
Substrate/Competitorn/a
Meas. Tech.ChEMBL_877904 (CHEMBL2188161)
IC50 97.72±n/a nM
Citation Yu, LFEaton, JBFedolak, AZhang, HKHanania, TBrunner, DLukas, RJKozikowski, AP Discovery of highly potent and selectivea4ß2-nicotinic acetylcholine receptor (nAChR) partial agonists containing an isoxazolylpyridine ether scaffold that demonstrate antidepressant-like activity. Part II. J Med Chem55:9998-10009 (2012) 
 
Neuronal acetylcholine receptor subunit alpha-4/beta-2
Name:Neuronal acetylcholine receptor subunit alpha-4/beta-2
Type:Protein
Mol. Mass.:n/a
Description:n/a
Components:This complex has 2 components.
Component 1
Name:Neuronal acetylcholine receptor subunit alpha-4
Synonyms:ACHA4_HUMAN CHRNA4 protein Neuronal acetylcholine receptor protein alpha-4 subunit Nicotinic acetylcholine receptor alpha4/beta2/alpha5
Type:n/a
Mol. Mass.:69963.49
Organism:Homo sapiens (Human)
Description:NACHRA4
Residue:627
Component 2
Name:Neuronal acetylcholine receptor subunit beta-2
Synonyms:ACHB2_HUMAN Neuronal acetylcholine receptor protein beta-2 subunit | Nicotinic acetylcholine receptor alpha3/beta2/alpha5
Type:Protein
Mol. Mass.:57020.50
Organism:Homo sapiens (Human)
Description:P17787
Residue:502
BDBM50399423
NameBDBM50399423
Synonyms:CHEMBL2178331
TypeSmall organic molecule
Emp. Form.C15H19N3O3
Mol. Mass.289.3297
SMILESCOCCc1cc(on1)-c1cncc(OC[C@@H]2CCN2)c1