Reaction Details
Target5-hydroxytryptamine receptor 3A
LigandBDBM50393247
Substrate/Competitorn/a
Meas. Tech.ChEMBL_877364 (CHEMBL2182409)
Ki>10000±n/a nM
Citation Mazurov, AAKombo, DCHauser, TAMiao, LDull, GGenus, JFFedorov, NBBenson, LSidach, SXiao, YHammond, PSJames, JWMiller, CHYohannes, D Discovery of (2S,3R)-N-[2-(Pyridin-3-ylmethyl)-1-azabicyclo[2.2.2]oct-3-yl]benzo[b]furan-2-carboxamide (TC-5619), a selectivea7 nicotinic acetylcholine receptor agonist, for the treatment of cognitive disorders. J Med Chem55:9793-809 (2012) 
 
5-hydroxytryptamine receptor 3A
Name:5-hydroxytryptamine receptor 3A
Type:Protein
Mol. Mass.:55283.27
Organism:Homo sapiens (Human)
Description:P46098
Residue:478
BDBM50393247
NameBDBM50393247
Synonyms:CHEMBL1258006
TypeSmall organic molecule
Emp. Form.C22H23N3O2
Mol. Mass.361.4369
SMILESO=C(N[C@@H]1C2CCN(CC2)[C@H]1Cc1cccnc1)c1cc2ccccc2o1