Reaction Details
TargetNeuronal acetylcholine receptor subunit alpha-7
LigandBDBM50393248
Substrate/Competitorn/a
Meas. Tech.ChEMBL_877369 (CHEMBL2182414)
EC50 60±n/a nM
Citation Mazurov, AAKombo, DCHauser, TAMiao, LDull, GGenus, JFFedorov, NBBenson, LSidach, SXiao, YHammond, PSJames, JWMiller, CHYohannes, D Discovery of (2S,3R)-N-[2-(Pyridin-3-ylmethyl)-1-azabicyclo[2.2.2]oct-3-yl]benzo[b]furan-2-carboxamide (TC-5619), a selectivea7 nicotinic acetylcholine receptor agonist, for the treatment of cognitive disorders. J Med Chem55:9793-809 (2012) 
 
Neuronal acetylcholine receptor subunit alpha-7
Name:Neuronal acetylcholine receptor subunit alpha-7
Type:Enzyme
Mol. Mass.:56502.44
Organism:Rattus norvegicus (Rat)
Description:Q05941
Residue:502
BDBM50393248
NameBDBM50393248
Synonyms:CHEMBL1258005
TypeSmall organic molecule
Emp. Form.C20H22BrN3O
Mol. Mass.400.312
SMILESBrc1ccc(cc1)C(=O)N[C@@H]1C2CCN(CC2)[C@H]1Cc1cccnc1