Reaction Details
TargetCalcitonin gene-related peptide type 1 receptor
LigandBDBM50400098
Substrate/Competitorn/a
Meas. Tech.ChEMBL_878109 (CHEMBL2183299)
EC50 0.14±n/a nM
Citation Luo, GChen, LConway, CMDenton, RKeavy, DSignor, LKostich, WLentz, KASantone, KSSchartman, RBrowning, MTong, GHouston, JGDubowchik, GMMacor, JE Discovery of (5S,6S,9R)-5-amino-6-(2,3-difluorophenyl)-6,7,8,9-tetrahydro-5H-cyclohepta[b]pyridin-9-yl 4-(2-oxo-2,3-dihydro-1H-imidazo[4,5-b]pyridin-1-yl)piperidine-1-carboxylate (BMS-927711): an oral calcitonin gene-related peptide (CGRP) antagonist in clinical trials for treating migraine. J Med Chem55:10644-51 (2012) 
 
Calcitonin gene-related peptide type 1 receptor
Name:Calcitonin gene-related peptide type 1 receptor
Type:Enzyme Catalytic Domain
Mol. Mass.:52980.45
Organism:Homo sapiens (Human)
Description:Q16602
Residue:461
BDBM50400098
NameBDBM50400098
Synonyms:CHEMBL2178422
TypeSmall organic molecule
Emp. Form.C28H28F2N6O3
Mol. Mass.534.5571
SMILESN[C@H]1[C@@H](CC[C@@H](OC(=O)N2CCC(CC2)n2c3cccnc3[nH]c2=O)c2ncccc12)c1cccc(F)c1F