Reaction Details
TargetAmine oxidase [flavin-containing] B
LigandBDBM50400104
Substrate/Competitorn/a
Meas. Tech.ChEMBL_878114 (CHEMBL2183304)
Ki 853±n/a nM
Citation Abdelhafez, OMAmin, KMAli, HIAbdalla, MMBatran, RZ Synthesis of new 7-oxycoumarin derivatives as potent and selective monoamine oxidase A inhibitors. J Med Chem55:10424-36 (2012) 
 
Amine oxidase [flavin-containing] B
Name:Amine oxidase [flavin-containing] B
Type:PROTEIN
Mol. Mass.:58428.94
Organism:Bos taurus
Description:ChEMBL_1501478
Residue:520
BDBM50400104
NameBDBM50400104
Synonyms:CHEMBL2178984
TypeSmall organic molecule
Emp. Form.C21H17ClN2O5S
Mol. Mass.444.888
SMILESCc1cc(=O)oc2cc(OCC(=O)NN3C(SCC3=O)c3ccc(Cl)cc3)ccc12