Reaction Details
TargetAmine oxidase [flavin-containing] B
LigandBDBM50400121
Substrate/Competitorn/a
Meas. Tech.ChEMBL_878114 (CHEMBL2183304)
Ki 535±n/a nM
Citation Abdelhafez, OMAmin, KMAli, HIAbdalla, MMBatran, RZ Synthesis of new 7-oxycoumarin derivatives as potent and selective monoamine oxidase A inhibitors. J Med Chem55:10424-36 (2012) 
 
Amine oxidase [flavin-containing] B
Name:Amine oxidase [flavin-containing] B
Type:PROTEIN
Mol. Mass.:58428.94
Organism:Bos taurus
Description:ChEMBL_1501478
Residue:520
BDBM50400121
NameBDBM50400121
Synonyms:CHEMBL2178430
TypeSmall organic molecule
Emp. Form.C20H23N3O4S2
Mol. Mass.433.544
SMILESCc1c(C)c(=O)oc2cc(OCc3nnc(SCCN4CCOCC4)s3)ccc12