Reaction Details
TargetAmine oxidase [flavin-containing] B
LigandBDBM50400124
Substrate/Competitorn/a
Meas. Tech.ChEMBL_878114 (CHEMBL2183304)
Ki 559±n/a nM
Citation Abdelhafez, OMAmin, KMAli, HIAbdalla, MMBatran, RZ Synthesis of new 7-oxycoumarin derivatives as potent and selective monoamine oxidase A inhibitors. J Med Chem55:10424-36 (2012) 
 
Amine oxidase [flavin-containing] B
Name:Amine oxidase [flavin-containing] B
Type:PROTEIN
Mol. Mass.:58428.94
Organism:Bos taurus
Description:ChEMBL_1501478
Residue:520
BDBM50400124
NameBDBM50400124
Synonyms:CHEMBL2178427
TypeSmall organic molecule
Emp. Form.C19H21N3O5S
Mol. Mass.403.452
SMILESCc1cc(=O)oc2cc(OCc3nnc(SCCN4CCOCC4)o3)ccc12