Reaction Details
TargetAmine oxidase [flavin-containing] B
LigandBDBM50400126
Substrate/Competitorn/a
Meas. Tech.ChEMBL_878114 (CHEMBL2183304)
Ki 812±n/a nM
Citation Abdelhafez, OMAmin, KMAli, HIAbdalla, MMBatran, RZ Synthesis of new 7-oxycoumarin derivatives as potent and selective monoamine oxidase A inhibitors. J Med Chem55:10424-36 (2012) 
 
Amine oxidase [flavin-containing] B
Name:Amine oxidase [flavin-containing] B
Type:PROTEIN
Mol. Mass.:58428.94
Organism:Bos taurus
Description:ChEMBL_1501478
Residue:520
BDBM50400126
NameBDBM50400126
Synonyms:CHEMBL2178425
TypeSmall organic molecule
Emp. Form.C19H23N3O3S2
Mol. Mass.405.534
SMILESCCN(CC)CCSc1nnc(COc2ccc3c(C)cc(=O)oc3c2)s1