Reaction Details
TargetAmine oxidase [flavin-containing] B
LigandBDBM50400132
Substrate/Competitorn/a
Meas. Tech.ChEMBL_878114 (CHEMBL2183304)
Ki 918±n/a nM
Citation Abdelhafez, OMAmin, KMAli, HIAbdalla, MMBatran, RZ Synthesis of new 7-oxycoumarin derivatives as potent and selective monoamine oxidase A inhibitors. J Med Chem55:10424-36 (2012) 
 
Amine oxidase [flavin-containing] B
Name:Amine oxidase [flavin-containing] B
Type:PROTEIN
Mol. Mass.:58428.94
Organism:Bos taurus
Description:ChEMBL_1501478
Residue:520
BDBM50400132
NameBDBM50400132
Synonyms:CHEMBL2178988
TypeSmall organic molecule
Emp. Form.C13H10N2O4S
Mol. Mass.290.295
SMILESCc1cc(=O)oc2cc(OCc3nnc(S)o3)ccc12