Reaction Details
TargetAmine oxidase [flavin-containing] A
LigandBDBM50400104
Substrate/Competitorn/a
Meas. Tech.ChEMBL_878115 (CHEMBL2183305)
Ki 0.011±n/a nM
Citation Abdelhafez, OMAmin, KMAli, HIAbdalla, MMBatran, RZ Synthesis of new 7-oxycoumarin derivatives as potent and selective monoamine oxidase A inhibitors. J Med Chem55:10424-36 (2012) 
 
Amine oxidase [flavin-containing] A
Name:Amine oxidase [flavin-containing] A
Type:PROTEIN
Mol. Mass.:59764.63
Organism:Bos taurus
Description:ChEMBL_1501477
Residue:527
BDBM50400104
NameBDBM50400104
Synonyms:CHEMBL2178984
TypeSmall organic molecule
Emp. Form.C21H17ClN2O5S
Mol. Mass.444.888
SMILESCc1cc(=O)oc2cc(OCC(=O)NN3C(SCC3=O)c3ccc(Cl)cc3)ccc12