Reaction Details
TargetAmine oxidase [flavin-containing] A
LigandBDBM50400130
Substrate/Competitorn/a
Meas. Tech.ChEMBL_878115 (CHEMBL2183305)
Ki 0.011±n/a nM
Citation Abdelhafez, OMAmin, KMAli, HIAbdalla, MMBatran, RZ Synthesis of new 7-oxycoumarin derivatives as potent and selective monoamine oxidase A inhibitors. J Med Chem55:10424-36 (2012) 
 
Amine oxidase [flavin-containing] A
Name:Amine oxidase [flavin-containing] A
Type:PROTEIN
Mol. Mass.:59764.63
Organism:Bos taurus
Description:ChEMBL_1501477
Residue:527
BDBM50400130
NameBDBM50400130
Synonyms:CHEMBL2178990
TypeSmall organic molecule
Emp. Form.C13H10N2O3S2
Mol. Mass.306.36
SMILESCc1cc(=O)oc2cc(OCc3nnc(S)s3)ccc12