Reaction Details
TargetAmine oxidase [flavin-containing] A
LigandBDBM50400132
Substrate/Competitorn/a
Meas. Tech.ChEMBL_878115 (CHEMBL2183305)
Ki 0.012±n/a nM
Citation Abdelhafez, OMAmin, KMAli, HIAbdalla, MMBatran, RZ Synthesis of new 7-oxycoumarin derivatives as potent and selective monoamine oxidase A inhibitors. J Med Chem55:10424-36 (2012) 
 
Amine oxidase [flavin-containing] A
Name:Amine oxidase [flavin-containing] A
Type:PROTEIN
Mol. Mass.:59764.63
Organism:Bos taurus
Description:ChEMBL_1501477
Residue:527
BDBM50400132
NameBDBM50400132
Synonyms:CHEMBL2178988
TypeSmall organic molecule
Emp. Form.C13H10N2O4S
Mol. Mass.290.295
SMILESCc1cc(=O)oc2cc(OCc3nnc(S)o3)ccc12