Reaction Details
TargetdTMP kinase
LigandBDBM50223806
Substrate/Competitorn/a
Meas. Tech.ChEMBL_877484 (CHEMBL2183638)
Ki 31000±n/a nM
Citation Cui, HCarrero-Lérida, JSilva, APWhittingham, JLBrannigan, JARuiz-Pérez, LMRead, KDWilson, KSGonzález-Pacanowska, DGilbert, IH Synthesis and evaluation ofa-thymidine analogues as novel antimalarials. J Med Chem55:10948-57 (2012) 
 
dTMP kinase
Name:dTMP kinase
Type:PROTEIN
Mol. Mass.:24691.81
Organism:Plasmodium falciparum (isolate 3D7)
Description:ChEMBL_877484
Residue:210
BDBM50223806
NameBDBM50223806
Synonyms:CHEMBL392137 | N-(5'-deoxy-alpha-D-thymidin-5'-yl)-N'-(3-trifluoromethyl-4-chlorophenyl)thiourea
TypeSmall organic molecule
Emp. Form.C18H18ClF3N4O4S
Mol. Mass.478.873
SMILESCc1cn([C@@H]2C[C@H](O)[C@@H](CNC(=S)Nc3ccc(Cl)c(c3)C(F)(F)F)O2)c(=O)[nH]c1=O