Reaction Details
TargetAminopeptidase N
LigandBDBM50400537
Substrate/Competitorn/a
Meas. Tech.ChEMBL_879813 (CHEMBL2210541)
IC50 910±n/a nM
Citation Su, LCao, JJia, YZhang, XFang, HXu, W Development of Synthetic Aminopeptidase N/CD13 Inhibitors to Overcome Cancer Metastasis and Angiogenesis. ACS Med Chem Lett3:959-964 (2012) 
 
Aminopeptidase N
Name:Aminopeptidase N
Type:PROTEIN
Mol. Mass.:109522.63
Organism:Homo sapiens (Human)
Description:ChEMBL_1507526
Residue:967
BDBM50400537
NameBDBM50400537
Synonyms:CHEMBL2204954
TypeSmall organic molecule
Emp. Form.C14H20FN3O3
Mol. Mass.297.3253
SMILESCC(C)C[C@H](NC(=O)NCc1ccc(F)cc1)C(=O)NO