Reaction Details
TargetSigma non-opioid intracellular receptor 1
LigandBDBM50400739
Substrate/Competitorn/a
Meas. Tech.ChEMBL_880513 (CHEMBL2211448)
Ki 103±n/a nM
Citation Yu, LFZhang, HKGunosewoyo, HKozikowski, AP From a4ß2 Nicotinic Ligands to the Discovery of s1 Receptor Ligands: Pharmacophore Analysis and Rational Design. ACS Med Chem Lett3:1054-1058 (2012) 
 
Sigma non-opioid intracellular receptor 1
Name:Sigma non-opioid intracellular receptor 1
Type:Enzyme Catalytic Domain
Mol. Mass.:25266.54
Organism:RAT
Description:Q9R0C9
Residue:223
BDBM50400739
NameBDBM50400739
Synonyms:CHEMBL2203550
TypeSmall organic molecule
Emp. Form.C13H14ClN3O3
Mol. Mass.295.722
SMILESClc1cncc(OCc2cc(OC[C@@H]3CCN3)no2)c1