Reaction Details
TargetHistamine H1 receptor
LigandBDBM50400738
Substrate/Competitorn/a
Meas. Tech.ChEMBL_880415 (CHEMBL2210098)
Ki>10000±n/a nM
Citation Yu, LFZhang, HKGunosewoyo, HKozikowski, AP From a4ß2 Nicotinic Ligands to the Discovery of s1 Receptor Ligands: Pharmacophore Analysis and Rational Design. ACS Med Chem Lett3:1054-1058 (2012) 
 
Histamine H1 receptor
Name:Histamine H1 receptor
Type:G Protein-Coupled Receptor (GPCR)
Mol. Mass.:55808.72
Organism:Homo sapiens (Human)
Description:Cell pellets from SK-N-MC cells transfected with human H1 receptor were used in binding assay.
Residue:487
BDBM50400738
NameBDBM50400738
Synonyms:CHEMBL2203551
TypeSmall organic molecule
Emp. Form.C15H18N2O3
Mol. Mass.274.315
SMILESC(Oc1cc(COc2ccccc2)on1)[C@@H]1CCCN1