Reaction Details
Target5-hydroxytryptamine receptor 2C
LigandBDBM50400741
Substrate/Competitorn/a
Meas. Tech.ChEMBL_880418 (CHEMBL2210101)
Ki>10000±n/a nM
Citation Yu, LFZhang, HKGunosewoyo, HKozikowski, AP From a4ß2 Nicotinic Ligands to the Discovery of s1 Receptor Ligands: Pharmacophore Analysis and Rational Design. ACS Med Chem Lett3:1054-1058 (2012) 
 
5-hydroxytryptamine receptor 2C
Name:5-hydroxytryptamine receptor 2C
Type:G Protein-Coupled Receptor (GPCR)
Mol. Mass.:51836.79
Organism:Homo sapiens (Human)
Description:P28335
Residue:458
BDBM50400741
NameBDBM50400741
Synonyms:CHEMBL2165447
TypeSmall organic molecule
Emp. Form.C14H16N2O3
Mol. Mass.260.2884
SMILESC(Oc1cc(COc2ccccc2)on1)[C@@H]1CCN1