Reaction Details
TargetGlucose-dependent insulinotropic receptor
LigandBDBM50400772
Substrate/Competitorn/a
Meas. Tech.ChEMBL_879044 (CHEMBL2208916)
Ki 9.3±n/a nM
Citation Abdel-Magid, AF GPR119 Modulators for the Treatment of Diabetes, Obesity, and Related Diseases: Patent Highlight. ACS Med Chem Lett3:955-958 (2012) 
 
Glucose-dependent insulinotropic receptor
Name:Glucose-dependent insulinotropic receptor
Type:Protein
Mol. Mass.:36901.49
Organism:Homo sapiens (Human)
Description:Q8TDV5
Residue:335
BDBM50400772
NameBDBM50400772
Synonyms:CHEMBL2204985
TypeSmall organic molecule
Emp. Form.C23H22FN7O
Mol. Mass.431.4655
SMILESCCc1cnc(nc1)N1CCC(CC1)n1ncc(COc2ccc(cc2F)C#N)c1C#N