Reaction Details
TargetProstaglandin E2 receptor EP3 subtype
LigandBDBM50400820
Substrate/Competitorn/a
Meas. Tech.ChEMBL_879335 (CHEMBL2208733)
Ki 6.7±n/a nM
Citation Meanwell, NA Synopsis of some recent tactical application of bioisosteres in drug design. J Med Chem54:2529-91 (2011) 
 
Prostaglandin E2 receptor EP3 subtype
Name:Prostaglandin E2 receptor EP3 subtype
Type:Enzyme
Mol. Mass.:43335.03
Organism:Homo sapiens (Human)
Description:P43115
Residue:390
BDBM50400820
NameBDBM50400820
Synonyms:CHEMBL2204337
TypeSmall organic molecule
Emp. Form.C23H17NO3S3
Mol. Mass.451.581
SMILESO=C(NS(=O)(=O)c1cccs1)\C=C\c1ccccc1Sc1ccc2ccccc2c1