Reaction Details
TargetD(1B) dopamine receptor
LigandBDBM50400823
Substrate/Competitorn/a
Meas. Tech.ChEMBL_879321 (CHEMBL2208719)
Ki 16.6±n/a nM
Citation Meanwell, NA Synopsis of some recent tactical application of bioisosteres in drug design. J Med Chem54:2529-91 (2011) 
 
D(1B) dopamine receptor
Name:D(1B) dopamine receptor
Type:Protein
Mol. Mass.:52943.41
Organism:Homo sapiens (Human)
Description:P21918
Residue:477
BDBM50400823
NameBDBM50400823
Synonyms:CHEMBL2204343
TypeSmall organic molecule
Emp. Form.C20H23ClFNO2Si
Mol. Mass.391.939
SMILESO[Si]1(CCN(CCCC(=O)c2ccc(F)cc2)CC1)c1ccc(Cl)cc1