Reaction Details
TargetFatty-acid amide hydrolase 1
LigandBDBM50400833
Substrate/Competitorn/a
Meas. Tech.ChEMBL_879293 (CHEMBL2208691)
Ki 3.5±n/a nM
Citation Meanwell, NA Synopsis of some recent tactical application of bioisosteres in drug design. J Med Chem54:2529-91 (2011) 
 
Fatty-acid amide hydrolase 1
Name:Fatty-acid amide hydrolase 1
Type:Protein
Mol. Mass.:63071.19
Organism:Homo sapiens (Human)
Description:O00519
Residue:579
BDBM50400833
NameBDBM50400833
Synonyms:CHEMBL220378
TypeSmall organic molecule
Emp. Form.C18H18F3NO3
Mol. Mass.353.3356
SMILESFC(F)(F)C(=O)c1cnc(o1)C(=O)CCCCCCc1ccccc1