Reaction Details
Target5-hydroxytryptamine receptor 1A
LigandBDBM50400886
Substrate/Competitorn/a
Meas. Tech.ChEMBL_880264 (CHEMBL2215842)
Ki 1100±n/a nM
Citation Bang-Andersen, BRuhland, TJørgensen, MSmith, GFrederiksen, KJensen, KGZhong, HNielsen, SMHogg, SMørk, AStensbøl, TB Discovery of 1-[2-(2,4-dimethylphenylsulfanyl)phenyl]piperazine (Lu AA21004): a novel multimodal compound for the treatment of major depressive disorder. J Med Chem54:3206-21 (2011) 
 
5-hydroxytryptamine receptor 1A
Name:5-hydroxytryptamine receptor 1A
Type:n/a
Mol. Mass.:46122.49
Organism:Homo sapiens (Human)
Description:n/a
Residue:422
BDBM50400886
NameBDBM50400886
Synonyms:CHEMBL2205039
TypeSmall organic molecule
Emp. Form.C17H19FN2S
Mol. Mass.302.41
SMILESCc1ccc(Sc2ccc(F)cc2)c(c1)N1CCNCC1