Reaction Details
Target5-hydroxytryptamine receptor 3A
LigandBDBM50400884
Substrate/Competitorn/a
Meas. Tech.ChEMBL_880265 (CHEMBL2215843)
Ki 64±n/a nM
Citation Bang-Andersen, BRuhland, TJørgensen, MSmith, GFrederiksen, KJensen, KGZhong, HNielsen, SMHogg, SMørk, AStensbøl, TB Discovery of 1-[2-(2,4-dimethylphenylsulfanyl)phenyl]piperazine (Lu AA21004): a novel multimodal compound for the treatment of major depressive disorder. J Med Chem54:3206-21 (2011) 
 
5-hydroxytryptamine receptor 3A
Name:5-hydroxytryptamine receptor 3A
Type:Protein
Mol. Mass.:55283.27
Organism:Homo sapiens (Human)
Description:P46098
Residue:478
BDBM50400884
NameBDBM50400884
Synonyms:CHEMBL2205041
TypeSmall organic molecule
Emp. Form.C16H18N2S
Mol. Mass.270.393
SMILESC1CN(CCN1)c1ccccc1Sc1ccccc1