Reaction Details
Target5-hydroxytryptamine receptor 3A
LigandBDBM50400910
Substrate/Competitorn/a
Meas. Tech.ChEMBL_880265 (CHEMBL2215843)
Ki 150±n/a nM
Citation Bang-Andersen, BRuhland, TJørgensen, MSmith, GFrederiksen, KJensen, KGZhong, HNielsen, SMHogg, SMørk, AStensbøl, TB Discovery of 1-[2-(2,4-dimethylphenylsulfanyl)phenyl]piperazine (Lu AA21004): a novel multimodal compound for the treatment of major depressive disorder. J Med Chem54:3206-21 (2011) 
 
5-hydroxytryptamine receptor 3A
Name:5-hydroxytryptamine receptor 3A
Type:Protein
Mol. Mass.:55283.27
Organism:Homo sapiens (Human)
Description:P46098
Residue:478
BDBM50400910
NameBDBM50400910
Synonyms:CHEMBL2204365
TypeSmall organic molecule
Emp. Form.C19H24N2S
Mol. Mass.312.472
SMILESCc1ccc(Sc2ccc(C)cc2N2CCNCC2)c(C)c1