Reaction Details
TargetSodium-dependent dopamine transporter
LigandBDBM50400889
Substrate/Competitorn/a
Meas. Tech.ChEMBL_880259 (CHEMBL2215837)
IC50 170±n/a nM
Citation Bang-Andersen, BRuhland, TJørgensen, MSmith, GFrederiksen, KJensen, KGZhong, HNielsen, SMHogg, SMørk, AStensbøl, TB Discovery of 1-[2-(2,4-dimethylphenylsulfanyl)phenyl]piperazine (Lu AA21004): a novel multimodal compound for the treatment of major depressive disorder. J Med Chem54:3206-21 (2011) 
 
Sodium-dependent dopamine transporter
Name:Sodium-dependent dopamine transporter
Type:Multi-pass membrane protein
Mol. Mass.:68749.45
Organism:Rattus norvegicus (rat)
Description:P23977
Residue:619
BDBM50400889
NameBDBM50400889
Synonyms:CHEMBL2204357
TypeSmall organic molecule
Emp. Form.C18H22N2S
Mol. Mass.298.446
SMILESCc1cccc(Sc2ccccc2N2CCNCC2)c1C