Reaction Details
TargetSodium-dependent dopamine transporter
LigandBDBM50400880
Substrate/Competitorn/a
Meas. Tech.ChEMBL_880259 (CHEMBL2215837)
IC50 110±n/a nM
Citation Bang-Andersen, BRuhland, TJørgensen, MSmith, GFrederiksen, KJensen, KGZhong, HNielsen, SMHogg, SMørk, AStensbøl, TB Discovery of 1-[2-(2,4-dimethylphenylsulfanyl)phenyl]piperazine (Lu AA21004): a novel multimodal compound for the treatment of major depressive disorder. J Med Chem54:3206-21 (2011) 
 
Sodium-dependent dopamine transporter
Name:Sodium-dependent dopamine transporter
Type:Multi-pass membrane protein
Mol. Mass.:68749.45
Organism:Rattus norvegicus (rat)
Description:P23977
Residue:619
BDBM50400880
NameBDBM50400880
Synonyms:CHEMBL2205045
TypeSmall organic molecule
Emp. Form.C17H20N2S
Mol. Mass.284.419
SMILESCc1ccc(Sc2ccccc2N2CCNCC2)cc1