Reaction Details
TargetSodium-dependent serotonin transporter
LigandBDBM50400904
Substrate/Competitorn/a
Meas. Tech.ChEMBL_880263 (CHEMBL2215841)
IC50 7.6±n/a nM
Citation Bang-Andersen, BRuhland, TJørgensen, MSmith, GFrederiksen, KJensen, KGZhong, HNielsen, SMHogg, SMørk, AStensbøl, TB Discovery of 1-[2-(2,4-dimethylphenylsulfanyl)phenyl]piperazine (Lu AA21004): a novel multimodal compound for the treatment of major depressive disorder. J Med Chem54:3206-21 (2011) 
 
Sodium-dependent serotonin transporter
Name:Sodium-dependent serotonin transporter
Type:Multi-pass membrane protein
Mol. Mass.:70168.43
Organism:Rattus norvegicus (rat)
Description:P31652
Residue:630
BDBM50400904
NameBDBM50400904
Synonyms:CHEMBL2204358
TypeSmall organic molecule
Emp. Form.C18H22N2O2S
Mol. Mass.330.444
SMILESCOc1ccc(Sc2ccccc2N2CCNCC2)c(OC)c1