Reaction Details
TargetCytochrome P450 1A2
LigandBDBM50400892
Substrate/Competitorn/a
Meas. Tech.ChEMBL_880250 (CHEMBL2215828)
IC50 26000±n/a nM
Citation Bang-Andersen, BRuhland, TJørgensen, MSmith, GFrederiksen, KJensen, KGZhong, HNielsen, SMHogg, SMørk, AStensbøl, TB Discovery of 1-[2-(2,4-dimethylphenylsulfanyl)phenyl]piperazine (Lu AA21004): a novel multimodal compound for the treatment of major depressive disorder. J Med Chem54:3206-21 (2011) 
 
Cytochrome P450 1A2
Name:Cytochrome P450 1A2
Type:Enzyme
Mol. Mass.:58423.38
Organism:Homo sapiens (Human)
Description:P05177
Residue:516
BDBM50400892
NameBDBM50400892
Synonyms:CHEMBL2205054
TypeSmall organic molecule
Emp. Form.C18H22N2S
Mol. Mass.298.446
SMILESCc1ccc(Sc2ccccc2N2CCNCC2)cc1C