Reaction Details
TargetCannabinoid receptor 2
LigandBDBM50401050
Substrate/Competitorn/a
Meas. Tech.ChEMBL_882431 (CHEMBL2210670)
Ki 10±n/a nM
Citation Wiley, JLSmith, VJChen, JMartin, BRHuffman, JW Synthesis and pharmacology of 1-alkyl-3-(1-naphthoyl)indoles: steric and electronic effects of 4- and 8-halogenated naphthoyl substituents. Bioorg Med Chem20:2067-81 (2012) 
 
Cannabinoid receptor 2
Name:Cannabinoid receptor 2
Type:G Protein-Coupled Receptor (GPCR)
Mol. Mass.:39690.94
Organism:Homo sapiens (Human)
Description:P34972
Residue:360
BDBM50401050
NameBDBM50401050
Synonyms:CHEMBL2206847
TypeSmall organic molecule
Emp. Form.C25H24BrNO
Mol. Mass.434.368
SMILESCCCCCn1c(C)c(C(=O)c2cccc3cccc(Br)c23)c2ccccc12