Reaction Details
TargetCannabinoid receptor 1
LigandBDBM50401066
Substrate/Competitorn/a
Meas. Tech.ChEMBL_882430 (CHEMBL2210669)
Ki 8.9±n/a nM
Citation Wiley, JLSmith, VJChen, JMartin, BRHuffman, JW Synthesis and pharmacology of 1-alkyl-3-(1-naphthoyl)indoles: steric and electronic effects of 4- and 8-halogenated naphthoyl substituents. Bioorg Med Chem20:2067-81 (2012) 
 
Cannabinoid receptor 1
Name:Cannabinoid receptor 1
Type:G Protein-Coupled Receptor (GPCR)
Mol. Mass.:52868.96
Organism:Homo sapiens (Human)
Description:P21554
Residue:472
BDBM50401066
NameBDBM50401066
Synonyms:CHEMBL2206860
TypeSmall organic molecule
Emp. Form.C25H24ClNO
Mol. Mass.389.917
SMILESCCCCCn1c(C)c(C(=O)c2ccc(Cl)c3ccccc23)c2ccccc12