Reaction Details
TargetThyroid hormone receptor beta
LigandBDBM18884
Substrate/Competitorn/a
Meas. Tech.ChEMBL_883204 (CHEMBL2212130)
Kd 35±n/a nM
Citation Joharapurkar, AADhote, VVJain, MR Selective thyromimetics using receptor and tissue selectivity approaches: prospects for dyslipidemia. J Med Chem55:5649-75 (2012) 
 
Thyroid hormone receptor beta
Name:Thyroid hormone receptor beta
Type:Receptor
Mol. Mass.:52793.62
Organism:Homo sapiens (Human)
Description:Recombinant hThR was obtained from nuclear extracts from SF9 cells infected with baculovirus vectors encoding for ThRbeta 1.
Residue:461
BDBM18884
NameBDBM18884
Synonyms:2-(4-{[4-hydroxy-3-(4-nitrophenyl)-5-(propan-2-yl)phenyl]methyl}-3,5-dimethylphenoxy)acetic acid JMC496635 Compound 4 | thyromimetic, 5a
TypeSmall organic molecule
Emp. Form.C26H27NO6
Mol. Mass.449.4957
SMILESCC(C)c1cc(Cc2c(C)cc(OCC(O)=O)cc2C)cc(c1O)-c1ccc(cc1)[N+]([O-])=O