Reaction Details
TargetThyroid hormone receptor alpha
LigandBDBM18869
Substrate/Competitorn/a
Meas. Tech.ChEMBL_883198 (CHEMBL2212124)
Ki 7.18±n/a nM
Citation Joharapurkar, AADhote, VVJain, MR Selective thyromimetics using receptor and tissue selectivity approaches: prospects for dyslipidemia. J Med Chem55:5649-75 (2012) 
 
Thyroid hormone receptor alpha
Name:Thyroid hormone receptor alpha
Type:Receptor
Mol. Mass.:54818.00
Organism:Homo sapiens (Human)
Description:Recombinant hThR was obtained from nuclear extracts from SF9 cells infected with baculovirus vectors encoding for ThRalpha 1.
Residue:490
BDBM18869
NameBDBM18869
Synonyms:2-{3,5-dichloro-4-[4-hydroxy-3-(propan-2-yl)phenoxy]phenyl}acetic acid KB-141
TypeSmall organic molecule
Emp. Form.C17H16Cl2O4
Mol. Mass.355.213
SMILESCC(C)c1cc(Oc2c(Cl)cc(CC(O)=O)cc2Cl)ccc1O