Reaction Details
TargetSerine/threonine-protein kinase SIK3 [59-1321]
LigandBDBM50401152
Substrate/Competitorn/a
Meas. Tech.ChEMBL_881210 (CHEMBL2211515)
IC50<10000±n/a nM
Citation Sunose, MBell, KEllard, KBergamini, GNeubauer, GWerner, TRamsden, N Discovery of 5-(2-amino-[1,2,4]triazolo[1,5-a]pyridin-7-yl)-N-(tert-butyl)pyridine-3-sulfonamide (CZC24758), as a potent, orally bioavailable and selective inhibitor of PI3K for the treatment of inflammatory disease. Bioorg Med Chem Lett22:4613-8 (2012) 
 
Serine/threonine-protein kinase SIK3 [59-1321]
Name:Serine/threonine-protein kinase SIK3 [59-1321]
Type:PROTEIN
Mol. Mass.:139984.87
Organism:Homo sapiens (Human)
Description:ChEMBL_774254
Residue:1263
BDBM50401152
NameBDBM50401152
Synonyms:CHEMBL2205766
TypeSmall organic molecule
Emp. Form.C15H18N6O2S
Mol. Mass.346.407
SMILESCC(C)(C)NS(=O)(=O)c1cncc(c1)-c1ccn2nc(N)nc2c1