Reaction Details
TargetPhosphatidylinositol 4,5-bisphosphate 3-kinase catalytic subunit alpha isoform
LigandBDBM50401251
Substrate/Competitorn/a
Meas. Tech.ChEMBL_882742 (CHEMBL2214064)
Ki 1.9±n/a nM
Citation Wurz, RPLiu, LYang, KNishimura, NBo, YPettus, LHCaenepeel, SFreeman, DJMcCarter, JDMullady, ELMiguel, TSWang, LZhang, NAndrews, KLWhittington, DAJiang, JSubramanian, RHughes, PENorman, MH Synthesis and structure-activity relationships of dual PI3K/mTOR inhibitors based on a 4-amino-6-methyl-1,3,5-triazine sulfonamide scaffold. Bioorg Med Chem Lett22:5714-20 (2012) 
 
Phosphatidylinositol 4,5-bisphosphate 3-kinase catalytic subunit alpha isoform
Name:Phosphatidylinositol 4,5-bisphosphate 3-kinase catalytic subunit alpha isoform
Type:Enzyme Subunit
Mol. Mass.:124294.87
Organism:Homo sapiens (Human)
Description:P42336
Residue:1068
BDBM50401251
NameBDBM50401251
Synonyms:CHEMBL2206909
TypeSmall organic molecule
Emp. Form.C21H27ClN10O3S
Mol. Mass.535.022
SMILESCN(C)S(=O)(=O)Nc1cc(Nc2ncc(CN3CCOCC3)cc2-c2nc(C)nc(N)n2)cnc1Cl