Reaction Details
TargetPhosphatidylinositol 4,5-bisphosphate 3-kinase catalytic subunit alpha isoform
LigandBDBM50401264
Substrate/Competitorn/a
Meas. Tech.ChEMBL_882742 (CHEMBL2214064)
Ki 3.5±n/a nM
Citation Wurz, RPLiu, LYang, KNishimura, NBo, YPettus, LHCaenepeel, SFreeman, DJMcCarter, JDMullady, ELMiguel, TSWang, LZhang, NAndrews, KLWhittington, DAJiang, JSubramanian, RHughes, PENorman, MH Synthesis and structure-activity relationships of dual PI3K/mTOR inhibitors based on a 4-amino-6-methyl-1,3,5-triazine sulfonamide scaffold. Bioorg Med Chem Lett22:5714-20 (2012) 
 
Phosphatidylinositol 4,5-bisphosphate 3-kinase catalytic subunit alpha isoform
Name:Phosphatidylinositol 4,5-bisphosphate 3-kinase catalytic subunit alpha isoform
Type:Enzyme Subunit
Mol. Mass.:124294.87
Organism:Homo sapiens (Human)
Description:P42336
Residue:1068
BDBM50401264
NameBDBM50401264
Synonyms:CHEMBL2206918
TypeSmall organic molecule
Emp. Form.C15H14Cl2N8O2S
Mol. Mass.441.295
SMILESCc1nc(N)nc(n1)-c1cc(Cl)cnc1Nc1cnc(Cl)c(NS(C)(=O)=O)c1