Reaction Details
TargetPhosphatidylinositol 3-kinase catalytic subunit type 3
LigandBDBM50401269
Substrate/Competitorn/a
Meas. Tech.ChEMBL_882538 (CHEMBL2211628)
IC50 1288±n/a nM
Citation Wurz, RPLiu, LYang, KNishimura, NBo, YPettus, LHCaenepeel, SFreeman, DJMcCarter, JDMullady, ELMiguel, TSWang, LZhang, NAndrews, KLWhittington, DAJiang, JSubramanian, RHughes, PENorman, MH Synthesis and structure-activity relationships of dual PI3K/mTOR inhibitors based on a 4-amino-6-methyl-1,3,5-triazine sulfonamide scaffold. Bioorg Med Chem Lett22:5714-20 (2012) 
 
Phosphatidylinositol 3-kinase catalytic subunit type 3
Name:Phosphatidylinositol 3-kinase catalytic subunit type 3
Type:Enzyme
Mol. Mass.:101551.30
Organism:Homo sapiens (Human)
Description:Recombinant human Vps34 protein was expressed as monomeric GST-fusion and purified.
Residue:887
BDBM50401269
NameBDBM50401269
Synonyms:CHEMBL2206913
TypeSmall organic molecule
Emp. Form.C15H15ClN8O2S
Mol. Mass.406.85
SMILESCc1nc(N)nc(n1)-c1cccnc1Nc1cnc(Cl)c(NS(C)(=O)=O)c1