Reaction Details
TargetSerine/threonine-protein kinase mTOR
LigandBDBM50401261
Substrate/Competitorn/a
Meas. Tech.ChEMBL_882539 (CHEMBL2211629)
IC50 163±n/a nM
Citation Wurz, RPLiu, LYang, KNishimura, NBo, YPettus, LHCaenepeel, SFreeman, DJMcCarter, JDMullady, ELMiguel, TSWang, LZhang, NAndrews, KLWhittington, DAJiang, JSubramanian, RHughes, PENorman, MH Synthesis and structure-activity relationships of dual PI3K/mTOR inhibitors based on a 4-amino-6-methyl-1,3,5-triazine sulfonamide scaffold. Bioorg Med Chem Lett22:5714-20 (2012) 
 
Serine/threonine-protein kinase mTOR
Name:Serine/threonine-protein kinase mTOR
Type:Rapamycin target protein
Mol. Mass.:288917.12
Organism:Homo sapiens (Human)
Description:P42345
Residue:2549
BDBM50401261
NameBDBM50401261
Synonyms:CHEMBL2206921 | US8772480, 384
TypeSmall organic molecule
Emp. Form.C16H17Cl2N9O2S
Mol. Mass.470.336
SMILESCN(C)S(=O)(=O)Nc1cc(Nc2ncc(Cl)cc2-c2nc(C)nc(N)n2)cnc1Cl