Reaction Details
TargetPhosphatidylinositol 4,5-bisphosphate 3-kinase catalytic subunit delta isoform
LigandBDBM50401269
Substrate/Competitorn/a
Meas. Tech.ChEMBL_882540 (CHEMBL2211630)
Ki 1.2±n/a nM
Citation Wurz, RPLiu, LYang, KNishimura, NBo, YPettus, LHCaenepeel, SFreeman, DJMcCarter, JDMullady, ELMiguel, TSWang, LZhang, NAndrews, KLWhittington, DAJiang, JSubramanian, RHughes, PENorman, MH Synthesis and structure-activity relationships of dual PI3K/mTOR inhibitors based on a 4-amino-6-methyl-1,3,5-triazine sulfonamide scaffold. Bioorg Med Chem Lett22:5714-20 (2012) 
 
Phosphatidylinositol 4,5-bisphosphate 3-kinase catalytic subunit delta isoform
Name:Phosphatidylinositol 4,5-bisphosphate 3-kinase catalytic subunit delta isoform
Type:Enzyme Subunit
Mol. Mass.:119489.41
Organism:Homo sapiens (Human)
Description:O00329
Residue:1044
BDBM50401269
NameBDBM50401269
Synonyms:CHEMBL2206913
TypeSmall organic molecule
Emp. Form.C15H15ClN8O2S
Mol. Mass.406.85
SMILESCc1nc(N)nc(n1)-c1cccnc1Nc1cnc(Cl)c(NS(C)(=O)=O)c1