Reaction Details
TargetLeucine-rich repeat serine/threonine-protein kinase 2
LigandBDBM482159
Substrate/Competitorn/a
Meas. Tech.ChEMBL_882822 (CHEMBL2215492)
IC50 10.9±n/a nM
Citation Reith, ADBamborough, PJandu, KAndreotti, DMensah, LDossang, PChoi, HGDeng, XZhang, JAlessi, DRGray, NS GSK2578215A; a potent and highly selective 2-arylmethyloxy-5-substitutent-N-arylbenzamide LRRK2 kinase inhibitor. Bioorg Med Chem Lett22:5625-9 (2012) 
 
Leucine-rich repeat serine/threonine-protein kinase 2
Name:Leucine-rich repeat serine/threonine-protein kinase 2
Type:Protein
Mol. Mass.:286113.20
Organism:Homo sapiens (Human)
Description:Q5S007
Residue:2527
BDBM482159
NameBDBM482159
Synonyms:BDBM50401284 | GSK2578215A
Typen/a
Emp. Form.C24H18FN3O2
Mol. Mass.399.417
SMILESFc1cc(ccn1)-c1ccc(OCc2ccccc2)c(c1)C(=O)Nc1cccnc1