Reaction Details
TargetC-C chemokine receptor type 1
LigandBDBM50401341
Substrate/Competitorn/a
Meas. Tech.ChEMBL_884032 (CHEMBL2215081)
IC50 4800±n/a nM
Citation Thiele, SMalmgaard-Clausen, MEngel-Andreasen, JSteen, ARummel, PCNielsen, MCGloriam, DEFrimurer, TMUlven, TRosenkilde, MM Modulation in selectivity and allosteric properties of small-molecule ligands for CC-chemokine receptors. J Med Chem55:8164-77 (2012) 
 
C-C chemokine receptor type 1
Name:C-C chemokine receptor type 1
Type:Enzyme
Mol. Mass.:41180.69
Organism:Homo sapiens (Human)
Description:P32246
Residue:355
BDBM50401341
NameBDBM50401341
Synonyms:CHEMBL2205803
TypeSmall organic molecule
Emp. Form.C14H8N2O2
Mol. Mass.236.2255
SMILESO=Cc1ccc2ccc3ccc(C=O)nc3c2n1