Reaction Details
TargetC-C chemokine receptor type 1
LigandBDBM50401345
Substrate/Competitorn/a
Meas. Tech.ChEMBL_884032 (CHEMBL2215081)
IC50 119000±n/a nM
Citation Thiele, SMalmgaard-Clausen, MEngel-Andreasen, JSteen, ARummel, PCNielsen, MCGloriam, DEFrimurer, TMUlven, TRosenkilde, MM Modulation in selectivity and allosteric properties of small-molecule ligands for CC-chemokine receptors. J Med Chem55:8164-77 (2012) 
 
C-C chemokine receptor type 1
Name:C-C chemokine receptor type 1
Type:Enzyme
Mol. Mass.:41180.69
Organism:Homo sapiens (Human)
Description:P32246
Residue:355
BDBM50401345
NameBDBM50401345
Synonyms:CHEMBL98682
TypeSmall organic molecule
Emp. Form.C13H10N2
Mol. Mass.194.2319
SMILESCc1cc2cccnc2c2ncccc12