Reaction Details
TargetC-C chemokine receptor type 1
LigandBDBM64740
Substrate/Competitorn/a
Meas. Tech.ChEMBL_884032 (CHEMBL2215081)
IC50>1000000±n/a nM
Citation Thiele, SMalmgaard-Clausen, MEngel-Andreasen, JSteen, ARummel, PCNielsen, MCGloriam, DEFrimurer, TMUlven, TRosenkilde, MM Modulation in selectivity and allosteric properties of small-molecule ligands for CC-chemokine receptors. J Med Chem55:8164-77 (2012) 
 
C-C chemokine receptor type 1
Name:C-C chemokine receptor type 1
Type:Enzyme
Mol. Mass.:41180.69
Organism:Homo sapiens (Human)
Description:P32246
Residue:355
BDBM64740
NameBDBM64740
Synonyms:2,9-dimethyl-1,10-phenanthroline SMR000555011 | cid_65237
TypeSmall organic molecule
Emp. Form.C14H12N2
Mol. Mass.208.2585
SMILESCc1ccc2ccc3ccc(C)nc3c2n1