Reaction Details
TargetC-C chemokine receptor type 1
LigandBDBM50401342
Substrate/Competitorn/a
Meas. Tech.ChEMBL_884039 (CHEMBL2215088)
EC50 10000±n/a nM
Citation Thiele, SMalmgaard-Clausen, MEngel-Andreasen, JSteen, ARummel, PCNielsen, MCGloriam, DEFrimurer, TMUlven, TRosenkilde, MM Modulation in selectivity and allosteric properties of small-molecule ligands for CC-chemokine receptors. J Med Chem55:8164-77 (2012) 
 
C-C chemokine receptor type 1
Name:C-C chemokine receptor type 1
Type:Enzyme
Mol. Mass.:41180.69
Organism:Homo sapiens (Human)
Description:P32246
Residue:355
BDBM50401342
NameBDBM50401342
Synonyms:CHEMBL2205802
TypeSmall organic molecule
Emp. Form.C14H12N2O2
Mol. Mass.240.2573
SMILESOCc1ccc2ccc3ccc(CO)nc3c2n1